Reaction Details
TargetNAD-dependent protein deacetylase sirtuin-1
LigandBDBM50425971
Substrate/Competitorn/a
Meas. Tech.ChEMBL_934582 (CHEMBL2317543)
Ki 800±n/a nM
Citation Wu, JLi, YChen, KJiang, HXu, MHLiu, D Identification of benzofuran-3-yl(phenyl)methanones as novel SIRT1 inhibitors: binding mode, inhibitory mechanism and biological action. Eur J Med Chem60:441-50 (2013) 
 
NAD-dependent protein deacetylase sirtuin-1
Name:NAD-dependent protein deacetylase sirtuin-1
Type:Developmental protein; hydrolase
Mol. Mass.:81626.66
Organism:Homo sapiens (Human)
Description:n/a
Residue:747
BDBM50425971
NameBDBM50425971
Synonyms:CHEMBL2314710
TypeSmall organic molecule
Emp. Form.C15H10O5
Mol. Mass.270.2369
SMILESOc1ccc(O)c(c1)C(=O)c1coc2ccc(O)cc12