Reaction Details
TargetCannabinoid receptor 1
LigandBDBM50426084
Substrate/Competitorn/a
Meas. Tech.ChEMBL_935498 (CHEMBL2319557)
Ki 67±n/a nM
Citation Aghazadeh Tabrizi, MBaraldi, PGSaponaro, GMoorman, ARRomagnoli, RPreti, DBaraldi, SCorciulo, CVincenzi, FBorea, PAVarani, K Design, synthesis, and pharmacological properties of new heteroarylpyridine/heteroarylpyrimidine derivatives as CB(2) cannabinoid receptor partial agonists. J Med Chem56:1098-112 (2013) 
 
Cannabinoid receptor 1
Name:Cannabinoid receptor 1
Type:G Protein-Coupled Receptor (GPCR)
Mol. Mass.:52856.55
Organism:Rattus norvegicus (rat)
Description:P20272
Residue:473
BDBM50426084
NameBDBM50426084
Synonyms:CHEMBL2316283
TypeSmall organic molecule
Emp. Form.C21H30N2O2S
Mol. Mass.374.54
SMILESCCCCCn1cc(C(=O)NC2CCCCCC2)c(=O)c2c(C)csc12