Reaction Details
TargetCannabinoid receptor 1
LigandBDBM50426111
Substrate/Competitorn/a
Meas. Tech.ChEMBL_935498 (CHEMBL2319557)
Ki>10000±n/a nM
Citation Aghazadeh Tabrizi, MBaraldi, PGSaponaro, GMoorman, ARRomagnoli, RPreti, DBaraldi, SCorciulo, CVincenzi, FBorea, PAVarani, K Design, synthesis, and pharmacological properties of new heteroarylpyridine/heteroarylpyrimidine derivatives as CB(2) cannabinoid receptor partial agonists. J Med Chem56:1098-112 (2013) 
 
Cannabinoid receptor 1
Name:Cannabinoid receptor 1
Type:G Protein-Coupled Receptor (GPCR)
Mol. Mass.:52856.55
Organism:Rattus norvegicus (rat)
Description:P20272
Residue:473
BDBM50426111
NameBDBM50426111
Synonyms:CHEMBL2316294
TypeSmall organic molecule
Emp. Form.C21H31N5O3
Mol. Mass.401.5025
SMILESCc1nn(C)c2n(CCN3CCOCC3)cc(C(=O)NC3CCCCC3)c(=O)c12