Reaction Details
TargetCannabinoid receptor 1
LigandBDBM21281
Substrate/Competitorn/a
Meas. Tech.ChEMBL_935498 (CHEMBL2319557)
Ki 14±n/a nM
Citation Aghazadeh Tabrizi, MBaraldi, PGSaponaro, GMoorman, ARRomagnoli, RPreti, DBaraldi, SCorciulo, CVincenzi, FBorea, PAVarani, K Design, synthesis, and pharmacological properties of new heteroarylpyridine/heteroarylpyrimidine derivatives as CB(2) cannabinoid receptor partial agonists. J Med Chem56:1098-112 (2013) 
 
Cannabinoid receptor 1
Name:Cannabinoid receptor 1
Type:G Protein-Coupled Receptor (GPCR)
Mol. Mass.:52856.55
Organism:Rattus norvegicus (rat)
Description:P20272
Residue:473
BDBM21281
NameBDBM21281
Synonyms:(11R)-2-methyl-11-(morpholin-4-ylmethyl)-3-(naphthalen-1-ylcarbonyl)-9-oxa-1-azatricyclo[6.3.1.0^{4,12}]dodeca-2,4(12),5,7-tetraene CHEMBL188 WIN 55212-2 WIN55212-2
TypeAnalgesic
Emp. Form.C27H26N2O3
Mol. Mass.426.5069
SMILESCc1c(C(=O)c2cccc3ccccc23)c2cccc3OC[C@@H](CN4CCOCC4)n1c23