Reaction Details
TargetCannabinoid receptor 1
LigandBDBM50426088
Substrate/Competitorn/a
Meas. Tech.ChEMBL_935497 (CHEMBL2319556)
Ki 155±n/a nM
Citation Aghazadeh Tabrizi, MBaraldi, PGSaponaro, GMoorman, ARRomagnoli, RPreti, DBaraldi, SCorciulo, CVincenzi, FBorea, PAVarani, K Design, synthesis, and pharmacological properties of new heteroarylpyridine/heteroarylpyrimidine derivatives as CB(2) cannabinoid receptor partial agonists. J Med Chem56:1098-112 (2013) 
 
Cannabinoid receptor 1
Name:Cannabinoid receptor 1
Type:G Protein-Coupled Receptor (GPCR)
Mol. Mass.:52868.96
Organism:Homo sapiens (Human)
Description:P21554
Residue:472
BDBM50426088
NameBDBM50426088
Synonyms:CHEMBL2316279
TypeSmall organic molecule
Emp. Form.C19H27N3O3
Mol. Mass.345.436
SMILESCCCCCn1cc(C(=O)NC2CCCCC2)c(=O)c2c(C)noc12