Reaction Details
TargetCannabinoid receptor 1
LigandBDBM50426115
Substrate/Competitorn/a
Meas. Tech.ChEMBL_935497 (CHEMBL2319556)
Ki>10000±n/a nM
Citation Aghazadeh Tabrizi, MBaraldi, PGSaponaro, GMoorman, ARRomagnoli, RPreti, DBaraldi, SCorciulo, CVincenzi, FBorea, PAVarani, K Design, synthesis, and pharmacological properties of new heteroarylpyridine/heteroarylpyrimidine derivatives as CB(2) cannabinoid receptor partial agonists. J Med Chem56:1098-112 (2013) 
 
Cannabinoid receptor 1
Name:Cannabinoid receptor 1
Type:G Protein-Coupled Receptor (GPCR)
Mol. Mass.:52868.96
Organism:Homo sapiens (Human)
Description:P21554
Residue:472
BDBM50426115
NameBDBM50426115
Synonyms:CHEMBL2316290
TypeSmall organic molecule
Emp. Form.C20H27N5O2
Mol. Mass.369.4607
SMILESCc1nn(C)c2n(CCCCC#N)cc(C(=O)NC3CCCCC3)c(=O)c12