Reaction Details
TargetCathepsin K
LigandBDBM50098577
Substrate/Competitorn/a
Meas. Tech.ChEMBL_935499 (CHEMBL2319558)
Ki 0.160000±n/a nM
Citation Schröder, JKlinger, AOellien, FMarhöfer, RJDuszenko, MSelzer, PM Docking-based virtual screening of covalently binding ligands: an orthogonal lead discovery approach. J Med Chem56:1478-90 (2013) 
 
Cathepsin K
Name:Cathepsin K
Type:Enzyme
Mol. Mass.:36975.68
Organism:Homo sapiens (Human)
Description:P43235
Residue:329
BDBM50098577
NameBDBM50098577
Synonyms:Benzofuran-2-carboxylic acid {3-methyl-1-[3-oxo-1-(pyridine-2-sulfonyl)-azepan-4-ylcarbamoyl]-butyl}-amide | CHEMBL31674
TypeSmall organic molecule
Emp. Form.C26H30N4O6S
Mol. Mass.526.605
SMILESCC(C)C[C@H](NC(=O)c1cc2ccccc2o1)C(=O)N[C@@H]1CCCN(CC1=O)S(=O)(=O)c1ccccn1