Reaction Details
TargetThreonine--tRNA ligase 1, cytoplasmic
LigandBDBM50426188
Substrate/Competitorn/a
Meas. Tech.ChEMBL_935846 (CHEMBL2317882)
Ki 1.2±n/a nM
Citation Teng, MHilgers, MTCunningham, MLBorchardt, ALocke, JBAbraham, SHaley, GKwan, BPHall, CHough, GWShaw, KJFinn, J Identification of bacteria-selective threonyl-tRNA synthetase substrate inhibitors by structure-based design. J Med Chem56:1748-60 (2013) 
 
Threonine--tRNA ligase 1, cytoplasmic
Name:Threonine--tRNA ligase 1, cytoplasmic
Type:PROTEIN
Mol. Mass.:83435.65
Organism:Homo sapiens (Human)
Description:ChEMBL_935846
Residue:723
BDBM50426188
NameBDBM50426188
Synonyms:CHEMBL2311920
TypeSmall organic molecule
Emp. Form.C18H18ClN5O4S
Mol. Mass.435.885
SMILESC[C@@H](O)[C@H](N)C(=O)NS(=O)(=O)c1cccc(c1)-c1ccc2c(N)nc(Cl)nc2c1