Reaction Details
TargetThreonine--tRNA ligase
LigandBDBM50426185
Substrate/Competitorn/a
Meas. Tech.ChEMBL_935847 (CHEMBL2317883)
Ki 115±n/a nM
Citation Teng, MHilgers, MTCunningham, MLBorchardt, ALocke, JBAbraham, SHaley, GKwan, BPHall, CHough, GWShaw, KJFinn, J Identification of bacteria-selective threonyl-tRNA synthetase substrate inhibitors by structure-based design. J Med Chem56:1748-60 (2013) 
 
Threonine--tRNA ligase
Name:Threonine--tRNA ligase
Type:PROTEIN
Mol. Mass.:73649.43
Organism:Yersinia pestis
Description:ChEMBL_935847
Residue:642
BDBM50426185
NameBDBM50426185
Synonyms:CHEMBL2311923
TypeSmall organic molecule
Emp. Form.C19H20N4O4S
Mol. Mass.400.451
SMILESC[C@@H](O)[C@H](N)C(=O)NS(=O)(=O)c1cccc(c1)-c1ccc2c(N)nccc2c1