Reaction Details
TargetMuscarinic acetylcholine receptor M5
LigandBDBM50426256
Substrate/Competitorn/a
Meas. Tech.ChEMBL_936414 (CHEMBL2317407)
Ki 30±n/a nM
Citation Zheng, GSmith, AMHuang, XSubramanian, KLSiripurapu, KBDeaciuc, AZhan, CGDwoskin, LP Structural modifications to tetrahydropyridine-3-carboxylate esters en route to the discovery of M5-preferring muscarinic receptor orthosteric antagonists. J Med Chem56:1693-703 (2013) 
 
Muscarinic acetylcholine receptor M5
Name:Muscarinic acetylcholine receptor M5
Type:PROTEIN
Mol. Mass.:60102.35
Organism:Homo sapiens (Human)
Description:ChEMBL_1517990
Residue:532
BDBM50426256
NameBDBM50426256
Synonyms:CHEMBL2312358
TypeSmall organic molecule
Emp. Form.C22H25NO3
Mol. Mass.351.4388
SMILESCOc1ccc(CCOC(=O)C2=C(CCN(C)C2)c2ccccc2)cc1