Reaction Details
TargetGlutamate receptor ionotropic, kainate 1
LigandBDBM50426289
Substrate/Competitorn/a
Meas. Tech.ChEMBL_936440 (CHEMBL2317649)
Ki 13±n/a nM
Citation Assaf, ZLarsen, APVenskutonyte, RHan, LAbrahamsen, BNielsen, BGajhede, MKastrup, JSJensen, AAPickering, DSFrydenvang, KGefflaut, TBunch, L Chemoenzymatic synthesis of new 2,4-syn-functionalized (S)-glutamate analogues and structure-activity relationship studies at ionotropic glutamate receptors and excitatory amino acid transporters. J Med Chem56:1614-28 (2013) 
 
Glutamate receptor ionotropic, kainate 1
Name:Glutamate receptor ionotropic, kainate 1
Type:Enzyme Catalytic Domain
Mol. Mass.:107860.82
Organism:RAT
Description:P22756
Residue:949
BDBM50426289
NameBDBM50426289
Synonyms:CHEMBL2312683
TypeSmall organic molecule
Emp. Form.C8H14N2O6
Mol. Mass.234.2066
SMILESN[C@@H](C[C@@H](CCC(=O)NO)C(O)=O)C(O)=O