Reaction Details
TargetCasein kinase I isoform alpha
LigandBDBM50191405
Substrate/Competitorn/a
Meas. Tech.ChEMBL_939731 (CHEMBL2329084)
IC50>10000±n/a nM
Citation Myrianthopoulos, VKritsanida, MGaboriaud-Kolar, NMagiatis, PFerandin, YDurieu, ELozach, OCappel, DSoundararajan, MFilippakopoulos, PSherman, WKnapp, SMeijer, LMikros, ESkaltsounis, AL Novel Inverse Binding Mode of Indirubin Derivatives Yields Improved Selectivity for DYRK Kinases. ACS Med Chem Lett4:22-26 (2013) 
 
Casein kinase I isoform alpha
Name:Casein kinase I isoform alpha
Type:PROTEIN
Mol. Mass.:14639.55
Organism:Sus scrofa
Description:ChEMBL_939731
Residue:125
BDBM50191405
NameBDBM50191405
Synonyms:(2'Z,3'E)-7-bromoindirubin-3'-oxime | CHEMBL373834
TypeSmall organic molecule
Emp. Form.C16H10BrN3O2
Mol. Mass.356.174
SMILESOc1[nH]c2c(Br)cccc2c1-c1[nH]c2ccccc2c1N=O