Reaction Details
TargetDual specificity tyrosine-phosphorylation-regulated kinase 1A
LigandBDBM50426337
Substrate/Competitorn/a
Meas. Tech.ChEMBL_939730 (CHEMBL2329083)
IC50 210±n/a nM
Citation Myrianthopoulos, VKritsanida, MGaboriaud-Kolar, NMagiatis, PFerandin, YDurieu, ELozach, OCappel, DSoundararajan, MFilippakopoulos, PSherman, WKnapp, SMeijer, LMikros, ESkaltsounis, AL Novel Inverse Binding Mode of Indirubin Derivatives Yields Improved Selectivity for DYRK Kinases. ACS Med Chem Lett4:22-26 (2013) 
 
Dual specificity tyrosine-phosphorylation-regulated kinase 1A
Name:Dual specificity tyrosine-phosphorylation-regulated kinase 1A
Type:Enzyme Catalytic Domain
Mol. Mass.:85573.59
Organism:RAT
Description:Dual-specificity tyrosine-(Y)-phosphorylation regulated kinase 1A 0 RAT::Q63470
Residue:763
BDBM50426337
NameBDBM50426337
Synonyms:CHEMBL1233659
TypeSmall organic molecule
Emp. Form.C17H10BrN3O4
Mol. Mass.400.183
SMILESOC(=O)c1ccc2[nH]c(C3C(=O)Nc4c3cccc4Br)c(N=O)c2c1