Reaction Details
TargetCasein kinase I isoform alpha
LigandBDBM50426331
Substrate/Competitorn/a
Meas. Tech.ChEMBL_939731 (CHEMBL2329084)
IC50 7400±n/a nM
Citation Myrianthopoulos, VKritsanida, MGaboriaud-Kolar, NMagiatis, PFerandin, YDurieu, ELozach, OCappel, DSoundararajan, MFilippakopoulos, PSherman, WKnapp, SMeijer, LMikros, ESkaltsounis, AL Novel Inverse Binding Mode of Indirubin Derivatives Yields Improved Selectivity for DYRK Kinases. ACS Med Chem Lett4:22-26 (2013) 
 
Casein kinase I isoform alpha
Name:Casein kinase I isoform alpha
Type:PROTEIN
Mol. Mass.:14639.55
Organism:Sus scrofa
Description:ChEMBL_939731
Residue:125
BDBM50426331
NameBDBM50426331
Synonyms:CHEMBL2321965
TypeSmall organic molecule
Emp. Form.C17H11BrN4O3
Mol. Mass.399.198
SMILESBrc1cccc2C(C(=O)Nc12)c1[nH]c2ccc(CN=O)cc2c1N=O