Reaction Details
TargetCasein kinase I isoform alpha
LigandBDBM50426315
Substrate/Competitorn/a
Meas. Tech.ChEMBL_939731 (CHEMBL2329084)
IC50 7400±n/a nM
Citation Myrianthopoulos, VKritsanida, MGaboriaud-Kolar, NMagiatis, PFerandin, YDurieu, ELozach, OCappel, DSoundararajan, MFilippakopoulos, PSherman, WKnapp, SMeijer, LMikros, ESkaltsounis, AL Novel Inverse Binding Mode of Indirubin Derivatives Yields Improved Selectivity for DYRK Kinases. ACS Med Chem Lett4:22-26 (2013) 
 
Casein kinase I isoform alpha
Name:Casein kinase I isoform alpha
Type:PROTEIN
Mol. Mass.:14639.55
Organism:Sus scrofa
Description:ChEMBL_939731
Residue:125
BDBM50426315
NameBDBM50426315
Synonyms:CHEMBL2321962
TypeSmall organic molecule
Emp. Form.C17H10BrN3O4
Mol. Mass.400.183
SMILESOC(=O)c1ccc2c(N=O)c([nH]c2c1)C1C(=O)Nc2c1cccc2Br