Reaction Details
TargetGlycogen synthase kinase-3 beta
LigandBDBM50426339
Substrate/Competitorn/a
Meas. Tech.ChEMBL_939732 (CHEMBL2329085)
IC50 100±n/a nM
Citation Myrianthopoulos, VKritsanida, MGaboriaud-Kolar, NMagiatis, PFerandin, YDurieu, ELozach, OCappel, DSoundararajan, MFilippakopoulos, PSherman, WKnapp, SMeijer, LMikros, ESkaltsounis, AL Novel Inverse Binding Mode of Indirubin Derivatives Yields Improved Selectivity for DYRK Kinases. ACS Med Chem Lett4:22-26 (2013) 
 
Glycogen synthase kinase-3 beta
Name:Glycogen synthase kinase-3 beta
Type:PROTEIN
Mol. Mass.:46774.42
Organism:Sus scrofa
Description:ChEMBL_939732
Residue:420
BDBM50426339
NameBDBM50426339
Synonyms:CHEMBL2321961
TypeSmall organic molecule
Emp. Form.C19H12F3N3O4
Mol. Mass.403.3115
SMILESCOC(=O)c1ccc2c(N=O)c([nH]c2c1)C1C(=O)Nc2c1cccc2C(F)(F)F