Reaction Details
TargetGlycogen synthase kinase-3 beta
LigandBDBM7401
Substrate/Competitorn/a
Meas. Tech.ChEMBL_939732 (CHEMBL2329085)
IC50 5.0±n/a nM
Citation Myrianthopoulos, VKritsanida, MGaboriaud-Kolar, NMagiatis, PFerandin, YDurieu, ELozach, OCappel, DSoundararajan, MFilippakopoulos, PSherman, WKnapp, SMeijer, LMikros, ESkaltsounis, AL Novel Inverse Binding Mode of Indirubin Derivatives Yields Improved Selectivity for DYRK Kinases. ACS Med Chem Lett4:22-26 (2013) 
 
Glycogen synthase kinase-3 beta
Name:Glycogen synthase kinase-3 beta
Type:PROTEIN
Mol. Mass.:46774.42
Organism:Sus scrofa
Description:ChEMBL_939732
Residue:420
BDBM7401
NameBDBM7401
Synonyms:(2 Z,3 E)-6-Bromoindirubin-3 -oxime 6-bromo-3-[(2Z,3E)-3-(hydroxyimino)-2,3-dihydro-1H-indol-2-ylidene]-2,3-dihydro-1H-indol-2-one 6BIO indirubin deriv. 7a
TypeSmall organic molecule
Emp. Form.C16H10BrN3O2
Mol. Mass.356.174
SMILESBrc1ccc2C(C(=O)Nc2c1)c1[nH]c2ccccc2c1N=O