Reaction Details
TargetCyclin-dependent kinase 5
LigandBDBM50426337
Substrate/Competitorn/a
Meas. Tech.ChEMBL_939733 (CHEMBL2329086)
IC50>10000±n/a nM
Citation Myrianthopoulos, VKritsanida, MGaboriaud-Kolar, NMagiatis, PFerandin, YDurieu, ELozach, OCappel, DSoundararajan, MFilippakopoulos, PSherman, WKnapp, SMeijer, LMikros, ESkaltsounis, AL Novel Inverse Binding Mode of Indirubin Derivatives Yields Improved Selectivity for DYRK Kinases. ACS Med Chem Lett4:22-26 (2013) 
 
Cyclin-dependent kinase 5
Name:Cyclin-dependent kinase 5
Type:Enzyme Subunit
Mol. Mass.:33308.61
Organism:Homo sapiens (Human)
Description:n/a
Residue:292
BDBM50426337
NameBDBM50426337
Synonyms:CHEMBL1233659
TypeSmall organic molecule
Emp. Form.C17H10BrN3O4
Mol. Mass.400.183
SMILESOC(=O)c1ccc2[nH]c(C3C(=O)Nc4c3cccc4Br)c(N=O)c2c1