Reaction Details
TargetCyclin-dependent kinase 5
LigandBDBM50426336
Substrate/Competitorn/a
Meas. Tech.ChEMBL_939733 (CHEMBL2329086)
IC50 530±n/a nM
Citation Myrianthopoulos, VKritsanida, MGaboriaud-Kolar, NMagiatis, PFerandin, YDurieu, ELozach, OCappel, DSoundararajan, MFilippakopoulos, PSherman, WKnapp, SMeijer, LMikros, ESkaltsounis, AL Novel Inverse Binding Mode of Indirubin Derivatives Yields Improved Selectivity for DYRK Kinases. ACS Med Chem Lett4:22-26 (2013) 
 
Cyclin-dependent kinase 5
Name:Cyclin-dependent kinase 5
Type:Enzyme Subunit
Mol. Mass.:33308.61
Organism:Homo sapiens (Human)
Description:n/a
Residue:292
BDBM50426336
NameBDBM50426336
Synonyms:CHEMBL2321952
TypeSmall organic molecule
Emp. Form.C17H11N3O4
Mol. Mass.321.2869
SMILESOC(=O)c1ccc2[nH]c(C3C(=O)Nc4ccccc34)c(N=O)c2c1