Reaction Details
TargetKynurenine--oxoglutarate transaminase 3
LigandBDBM50426340
Substrate/Competitorn/a
Meas. Tech.ChEMBL_939752 (CHEMBL2329105)
IC50 13600±n/a nM
Citation Tuttle, JBAnderson, MBechle, BMCampbell, BMChang, CDounay, ABEvrard, EFonseca, KRGan, XGhosh, SHorner, WJames, LCKim, JYMcAllister, LAPandit, JParikh, VDRago, BJSalafia, MAStrick, CAZawadzke, LEVerhoest, PR Structure-Based Design of Irreversible Human KAT II Inhibitors: Discovery of New Potency-Enhancing Interactions. ACS Med Chem Lett4:37-40 (2013) 
 
Kynurenine--oxoglutarate transaminase 3
Name:Kynurenine--oxoglutarate transaminase 3
Type:PROTEIN
Mol. Mass.:51406.81
Organism:Homo sapiens (Human)
Description:ChEMBL_939752
Residue:454
BDBM50426340
NameBDBM50426340
Synonyms:CHEMBL2321943
TypeSmall organic molecule
Emp. Form.C16H16N2O4
Mol. Mass.300.3092
SMILESCOc1cc2N(O)C(=O)[C@@H](N)Cc2cc1Oc1ccccc1