Reaction Details
TargetKynurenine--oxoglutarate transaminase 1
LigandBDBM50426341
Substrate/Competitorn/a
Meas. Tech.ChEMBL_939755 (CHEMBL2329108)
IC50 2040±n/a nM
Citation Tuttle, JBAnderson, MBechle, BMCampbell, BMChang, CDounay, ABEvrard, EFonseca, KRGan, XGhosh, SHorner, WJames, LCKim, JYMcAllister, LAPandit, JParikh, VDRago, BJSalafia, MAStrick, CAZawadzke, LEVerhoest, PR Structure-Based Design of Irreversible Human KAT II Inhibitors: Discovery of New Potency-Enhancing Interactions. ACS Med Chem Lett4:37-40 (2013) 
 
Kynurenine--oxoglutarate transaminase 1
Name:Kynurenine--oxoglutarate transaminase 1
Type:Aminotransferase; Lyase
Mol. Mass.:47874.00
Organism:Homo sapiens (Human)
Description:Recombinant hKAT-1 was expressed and purified from Sf9 insect cells.
Residue:422
BDBM50426341
NameBDBM50426341
Synonyms:CHEMBL2321944
TypeSmall organic molecule
Emp. Form.C15H14N2O3
Mol. Mass.270.2833
SMILESN[C@H]1Cc2cc(Oc3ccccc3)ccc2N(O)C1=O