Reaction Details
TargetKynurenine--oxoglutarate transaminase 1
LigandBDBM50386310
Substrate/Competitorn/a
Meas. Tech.ChEMBL_939755 (CHEMBL2329108)
IC50 15300±n/a nM
Citation Tuttle, JBAnderson, MBechle, BMCampbell, BMChang, CDounay, ABEvrard, EFonseca, KRGan, XGhosh, SHorner, WJames, LCKim, JYMcAllister, LAPandit, JParikh, VDRago, BJSalafia, MAStrick, CAZawadzke, LEVerhoest, PR Structure-Based Design of Irreversible Human KAT II Inhibitors: Discovery of New Potency-Enhancing Interactions. ACS Med Chem Lett4:37-40 (2013) 
 
Kynurenine--oxoglutarate transaminase 1
Name:Kynurenine--oxoglutarate transaminase 1
Type:Aminotransferase; Lyase
Mol. Mass.:47874.00
Organism:Homo sapiens (Human)
Description:Recombinant hKAT-1 was expressed and purified from Sf9 insect cells.
Residue:422
BDBM50386310
NameBDBM50386310
Synonyms:CHEMBL2049092
TypeSmall organic molecule
Emp. Form.C10H12N2O3
Mol. Mass.208.2139
SMILESCOc1ccc2C[C@H](N)C(=O)N(O)c2c1