Reaction Details
TargetPotassium voltage-gated channel subfamily H member 2
LigandBDBM50426351
Substrate/Competitorn/a
Meas. Tech.ChEMBL_939922 (CHEMBL2327304)
IC50 21000±n/a nM
Citation Brown, DGBernstein, PRWu, YUrbanek, RABecker, CWThroner, SRDembofsky, BTSteelman, GBLazor, LAScott, CWWood, MWWesolowski, SSNugiel, DAKoch, SYu, JPivonka, DELi, SThompson, CZacco, AElmore, CSSchroeder, PLiu, JHurley, CAWard, SHunt, HJWilliams, KMcLaughlin, JHoesch, VSydserff, SMaier, DAharony, D Azepines and piperidines with dual norepinephrine dopamine uptake inhibition and antidepressant activity. ACS Med Chem Lett4:46-51 (2013) 
 
Potassium voltage-gated channel subfamily H member 2
Name:Potassium voltage-gated channel subfamily H member 2
Type:Multi-pass membrane protein
Mol. Mass.:126672.65
Organism:Homo sapiens (Human)
Description:Q12809
Residue:1159
BDBM50426351
NameBDBM50426351
Synonyms:CHEMBL2321999
TypeSmall organic molecule
Emp. Form.C12H13Cl2N
Mol. Mass.242.144
SMILESClc1ccc(cc1Cl)[C@@H]1CNCC=CC1