Reaction Details
TargetSodium-dependent serotonin transporter
LigandBDBM50426352
Substrate/Competitorn/a
Meas. Tech.ChEMBL_939921 (CHEMBL2327303)
Ki 100±n/a nM
Citation Brown, DGBernstein, PRWu, YUrbanek, RABecker, CWThroner, SRDembofsky, BTSteelman, GBLazor, LAScott, CWWood, MWWesolowski, SSNugiel, DAKoch, SYu, JPivonka, DELi, SThompson, CZacco, AElmore, CSSchroeder, PLiu, JHurley, CAWard, SHunt, HJWilliams, KMcLaughlin, JHoesch, VSydserff, SMaier, DAharony, D Azepines and piperidines with dual norepinephrine dopamine uptake inhibition and antidepressant activity. ACS Med Chem Lett4:46-51 (2013) 
 
Sodium-dependent serotonin transporter
Name:Sodium-dependent serotonin transporter
Type:Multi-pass membrane protein
Mol. Mass.:70322.51
Organism:Homo sapiens (Human)
Description:P31645
Residue:630
BDBM50426352
NameBDBM50426352
Synonyms:CHEMBL2321996
TypeSmall organic molecule
Emp. Form.C13H15Cl2N
Mol. Mass.256.171
SMILESCN1CC=CC[C@@H](C1)c1ccc(Cl)c(Cl)c1