Reaction Details
TargetSodium-dependent dopamine transporter
LigandBDBM50426357
Substrate/Competitorn/a
Meas. Tech.ChEMBL_939923 (CHEMBL2327305)
Ki 4.2±n/a nM
Citation Brown, DGBernstein, PRWu, YUrbanek, RABecker, CWThroner, SRDembofsky, BTSteelman, GBLazor, LAScott, CWWood, MWWesolowski, SSNugiel, DAKoch, SYu, JPivonka, DELi, SThompson, CZacco, AElmore, CSSchroeder, PLiu, JHurley, CAWard, SHunt, HJWilliams, KMcLaughlin, JHoesch, VSydserff, SMaier, DAharony, D Azepines and piperidines with dual norepinephrine dopamine uptake inhibition and antidepressant activity. ACS Med Chem Lett4:46-51 (2013) 
 
Sodium-dependent dopamine transporter
Name:Sodium-dependent dopamine transporter
Type:Multi-pass membrane protein
Mol. Mass.:68497.11
Organism:Homo sapiens (Human)
Description:Q01959
Residue:620
BDBM50426357
NameBDBM50426357
Synonyms:CHEMBL2326695
TypeSmall organic molecule
Emp. Form.C14H19Cl2NO
Mol. Mass.288.213
SMILESOCC[C@@]1(CCCCNC1)c1ccc(Cl)c(Cl)c1