Reaction Details
TargetSodium-dependent noradrenaline transporter
LigandBDBM50021218
Substrate/Competitorn/a
Meas. Tech.ChEMBL_939924 (CHEMBL2327306)
Ki 4.0±n/a nM
Citation Brown, DGBernstein, PRWu, YUrbanek, RABecker, CWThroner, SRDembofsky, BTSteelman, GBLazor, LAScott, CWWood, MWWesolowski, SSNugiel, DAKoch, SYu, JPivonka, DELi, SThompson, CZacco, AElmore, CSSchroeder, PLiu, JHurley, CAWard, SHunt, HJWilliams, KMcLaughlin, JHoesch, VSydserff, SMaier, DAharony, D Azepines and piperidines with dual norepinephrine dopamine uptake inhibition and antidepressant activity. ACS Med Chem Lett4:46-51 (2013) 
 
Sodium-dependent noradrenaline transporter
Name:Sodium-dependent noradrenaline transporter
Type:Multi-pass membrane protein
Mol. Mass.:69337.72
Organism:Homo sapiens (Human)
Description:P23975
Residue:617
BDBM50021218
NameBDBM50021218
Synonyms:(S)-2-methyl-4-phenyl-1,2,3,4-tetrahydroisoquinolin-8-amine CHEMBL51697
TypeSmall organic molecule
Emp. Form.C16H18N2
Mol. Mass.238.3275
SMILESCN1C[C@@H](c2ccccc2)c2cccc(N)c2C1