Reaction Details
TargetTransporter
LigandBDBM50005548
Substrate/Competitorn/a
Meas. Tech.ChEMBL_939783 (CHEMBL2329267)
Ki 4.0±n/a nM
Citation Brown, DGBernstein, PRWu, YUrbanek, RABecker, CWThroner, SRDembofsky, BTSteelman, GBLazor, LAScott, CWWood, MWWesolowski, SSNugiel, DAKoch, SYu, JPivonka, DELi, SThompson, CZacco, AElmore, CSSchroeder, PLiu, JHurley, CAWard, SHunt, HJWilliams, KMcLaughlin, JHoesch, VSydserff, SMaier, DAharony, D Azepines and piperidines with dual norepinephrine dopamine uptake inhibition and antidepressant activity. ACS Med Chem Lett4:46-51 (2013) 
 
Transporter
Name:Transporter
Type:Multi-pass membrane protein
Mol. Mass.:69236.90
Organism:Rattus norvegicus (rat)
Description:Q63380
Residue:617
BDBM50005548
NameBDBM50005548
Synonyms:(+)-2-Methyl-4-phenyl-1,2,3,4-tetrahydro-isoquinolin-8-ylamine (-)-2-Methyl-4-phenyl-1,2,3,4-tetrahydro-isoquinolin-8-ylamine 2-Methyl-4-phenyl-1,2,3,4-tetrahydro-isoquinolin-8-ylamine 2-Methyl-4-phenyl-1,2,3,4-tetrahydro-isoquinolin-8-ylamine(Nomifensine) CHEMBL273575 NOMIFENSINE2-Methyl-4-phenyl-1,2,3,4-tetrahydro-isoquinolin-8-ylamine
TypeSmall organic molecule
Emp. Form.C16H18N2
Mol. Mass.238.3275
SMILESCN1CC(c2ccccc2)c2cccc(N)c2C1