Reaction Details
TargetSodium-dependent noradrenaline transporter
LigandBDBM50426356
Substrate/Competitorn/a
Meas. Tech.ChEMBL_939924 (CHEMBL2327306)
Ki 49±n/a nM
Citation Brown, DGBernstein, PRWu, YUrbanek, RABecker, CWThroner, SRDembofsky, BTSteelman, GBLazor, LAScott, CWWood, MWWesolowski, SSNugiel, DAKoch, SYu, JPivonka, DELi, SThompson, CZacco, AElmore, CSSchroeder, PLiu, JHurley, CAWard, SHunt, HJWilliams, KMcLaughlin, JHoesch, VSydserff, SMaier, DAharony, D Azepines and piperidines with dual norepinephrine dopamine uptake inhibition and antidepressant activity. ACS Med Chem Lett4:46-51 (2013) 
 
Sodium-dependent noradrenaline transporter
Name:Sodium-dependent noradrenaline transporter
Type:Multi-pass membrane protein
Mol. Mass.:69337.72
Organism:Homo sapiens (Human)
Description:P23975
Residue:617
BDBM50426356
NameBDBM50426356
Synonyms:CHEMBL2321990
TypeSmall organic molecule
Emp. Form.C14H19Cl2NO
Mol. Mass.288.213
SMILESOCC[C@]1(CCCCNC1)c1ccc(Cl)c(Cl)c1