Reaction Details
TargetSodium-dependent noradrenaline transporter
LigandBDBM50426358
Substrate/Competitorn/a
Meas. Tech.ChEMBL_939924 (CHEMBL2327306)
Ki 15±n/a nM
Citation Brown, DGBernstein, PRWu, YUrbanek, RABecker, CWThroner, SRDembofsky, BTSteelman, GBLazor, LAScott, CWWood, MWWesolowski, SSNugiel, DAKoch, SYu, JPivonka, DELi, SThompson, CZacco, AElmore, CSSchroeder, PLiu, JHurley, CAWard, SHunt, HJWilliams, KMcLaughlin, JHoesch, VSydserff, SMaier, DAharony, D Azepines and piperidines with dual norepinephrine dopamine uptake inhibition and antidepressant activity. ACS Med Chem Lett4:46-51 (2013) 
 
Sodium-dependent noradrenaline transporter
Name:Sodium-dependent noradrenaline transporter
Type:Multi-pass membrane protein
Mol. Mass.:69337.72
Organism:Homo sapiens (Human)
Description:P23975
Residue:617
BDBM50426358
NameBDBM50426358
Synonyms:CHEMBL2326694
TypeSmall organic molecule
Emp. Form.C15H19Cl2NO
Mol. Mass.300.223
SMILESCOCCN1CC=CC[C@@H](C1)c1ccc(Cl)c(Cl)c1