Reaction Details
TargetCell division cycle 7-related protein kinase
LigandBDBM50426470
Substrate/Competitorn/a
Meas. Tech.ChEMBL_940355 (CHEMBL2328973)
Ki 15±n/a nM
Citation Tong, YStewart, KDFlorjancic, ASHarlan, JEMerta, PJPrzytulinska, MSoni, NSwinger, KKZhu, HJohnson, EFShoemaker, ARPenning, TD Azaindole-Based Inhibitors of Cdc7 Kinase: Impact of the Pre-DFG Residue, Val 195. ACS Med Chem Lett4:211-5 (2013) 
 
Cell division cycle 7-related protein kinase
Name:Cell division cycle 7-related protein kinase
Type:Protein
Mol. Mass.:63908.16
Organism:Homo sapiens (Human)
Description:O00311
Residue:574
BDBM50426470
NameBDBM50426470
Synonyms:CHEMBL2322680
TypeSmall organic molecule
Emp. Form.C20H18N4
Mol. Mass.314.3837
SMILESCc1cc(cc(NCc2ccccc2)n1)-c1c[nH]c2ncccc12