Reaction Details
TargetCyclin-dependent kinase 4
LigandBDBM50426474
Substrate/Competitorn/a
Meas. Tech.ChEMBL_940532 (CHEMBL2327150)
IC50>10000±n/a nM
Citation Liu, JJHiggins, BJu, GKolinsky, KLuk, KCPackman, KPizzolato, GRen, YThakkar, KTovar, CZhang, ZWovkulich, PM Discovery of a highly potent, orally active mitosis/angiogenesis inhibitor r1530 for the treatment of solid tumors. ACS Med Chem Lett4:259-63 (2013) 
 
Cyclin-dependent kinase 4
Name:Cyclin-dependent kinase 4
Type:Enzyme Subunit
Mol. Mass.:33731.96
Organism:Homo sapiens (Human)
Description:P11802
Residue:303
BDBM50426474
NameBDBM50426474
Synonyms:CHEMBL1980391
TypeSmall organic molecule
Emp. Form.C18H14ClFN4O
Mol. Mass.356.781
SMILESCOc1cc2Nc3[nH]nc(C)c3N=C(c3ccccc3Cl)c2cc1F