Reaction Details
TargetProtein-arginine deiminase type-4
LigandBDBM50355657
Substrate/Competitorn/a
Meas. Tech.ChEMBL_938239 (CHEMBL2328662)
IC50 5900±n/a nM
Citation Bello, AMWasilewski, EWei, LMoscarello, MAKotra, LP Interrogation of the Active Sites of Protein Arginine Deiminases (PAD1, -2, and -4) Using Designer Probes. ACS Med Chem Lett4:249-53 (2013) 
 
Protein-arginine deiminase type-4
Name:Protein-arginine deiminase type-4
Type:Enzyme Catalytic Domain
Mol. Mass.:74078.90
Organism:Homo sapiens (Human)
Description:gi_216548487
Residue:663
BDBM50355657
NameBDBM50355657
Synonyms:CHEMBL1910972 | CHEMBL1962361
TypeSmall organic molecule
Emp. Form.C14H19ClN4O2
Mol. Mass.310.779
SMILESNC(=O)[C@H](CCCN=C(N)CCl)NC(=O)c1ccccc1