Reaction Details
TargetAcetyl-CoA carboxylase 1
LigandBDBM50426524
Substrate/Competitorn/a
Meas. Tech.ChEMBL_938403 (CHEMBL2329346)
IC50 11±n/a nM
Citation Abdel-Magid, AF Treatment of Obesity and Related Disorders with Acetyl-CoA Carboxylase Inhibitors. ACS Med Chem Lett4:16-7 (2013) 
 
Acetyl-CoA carboxylase 1
Name:Acetyl-CoA carboxylase 1
Type:Protein
Mol. Mass.:265543.22
Organism:Homo sapiens (Human)
Description:Q13085
Residue:2346
BDBM50426524
NameBDBM50426524
Synonyms:CHEMBL2323629
TypeSmall organic molecule
Emp. Form.C24H27N5O3
Mol. Mass.433.5029
SMILESCC(C)n1ncc2CC3(CCN(CC3)C(=O)c3ccc4[nH]c(cc4c3)C(N)=O)CC(=O)c12