Reaction Details
TargetBotulinum neurotoxin type A
LigandBDBM50076267
Substrate/Competitorn/a
Meas. Tech.ChEMBL_938417 (CHEMBL2329360)
Ki 6700±n/a nM
Citation Silhár, PLardy, MAHixon, MSShoemaker, CBBarbieri, JTStruss, AKLively, JMJavor, SJanda, KD The C-terminus of Botulinum A Protease Has Profound and Unanticipated Kinetic Consequences Upon the Catalytic Cleft. ACS Med Chem Lett4:283-287 (2013) 
 
Botulinum neurotoxin type A
Name:Botulinum neurotoxin type A
Type:PROTEIN
Mol. Mass.:149450.01
Organism:Clostridium botulinum
Description:ChEMBL_1510137
Residue:1296
BDBM50076267
NameBDBM50076267
Synonyms:(2S,3S)-2,3-Bis-[(E)-3-(3,4-dihydroxy-phenyl)-acryloyloxy]-succinic acid D-chicoric acid | chicoric acid
TypeSmall organic molecule
Emp. Form.C22H18O12
Mol. Mass.474.3711
SMILESOC(=O)[C@@H](OC(=O)\C=C\c1ccc(O)c(O)c1)[C@H](OC(=O)\C=C\c1ccc(O)c(O)c1)C(O)=O