Reaction Details
TargetBotulinum neurotoxin type A
LigandBDBM23274
Substrate/Competitorn/a
Meas. Tech.ChEMBL_938419 (CHEMBL2329362)
Ki 5600±n/a nM
Citation Silhár, PLardy, MAHixon, MSShoemaker, CBBarbieri, JTStruss, AKLively, JMJavor, SJanda, KD The C-terminus of Botulinum A Protease Has Profound and Unanticipated Kinetic Consequences Upon the Catalytic Cleft. ACS Med Chem Lett4:283-287 (2013) 
 
Botulinum neurotoxin type A
Name:Botulinum neurotoxin type A
Type:PROTEIN
Mol. Mass.:149450.01
Organism:Clostridium botulinum
Description:ChEMBL_1510137
Residue:1296
BDBM23274
NameBDBM23274
Synonyms:(2E)-3-(2,4-dichlorophenyl)-N-hydroxyprop-2-enamide BMCL176463 Compound 2 | Cinnamic hydroxamate deriv., 18
TypeSmall organic molecule
Emp. Form.C9H7Cl2NO2
Mol. Mass.232.063
SMILESONC(=O)\C=C\c1ccc(Cl)cc1Cl