Reaction Details
TargetHypoxia-inducible factor 1-alpha
LigandBDBM50426549
Substrate/Competitorn/a
Meas. Tech.ChEMBL_938618 (CHEMBL2327238)
IC50 270±n/a nM
Citation Minegishi, HFukashiro, SBan, HSNakamura, H Discovery of Indenopyrazoles as a New Class of Hypoxia Inducible Factor (HIF)-1 Inhibitors. ACS Med Chem Lett4:297-301 (2013) 
 
Hypoxia-inducible factor 1-alpha
Name:Hypoxia-inducible factor 1-alpha
Type:Protein
Mol. Mass.:92647.24
Organism:Homo sapiens (Human)
Description:Q16665
Residue:826
BDBM50426549
NameBDBM50426549
Synonyms:CHEMBL2323955
TypeSmall organic molecule
Emp. Form.C17H13N3O2
Mol. Mass.291.304
SMILESC1Oc2ccc(Nc3[nH]nc-4c3Cc3ccccc-43)cc2O1