Reaction Details
TargetCaspase-10
LigandBDBM50426564
Substrate/Competitorn/a
Meas. Tech.ChEMBL_938626 (CHEMBL2327246)
IC50 2670±n/a nM
Citation Rosse, G Irreversible inhibitors of cysteine proteases. ACS Med Chem Lett4:163-4 (2013) 
 
Caspase-10
Name:Caspase-10
Type:Enzyme
Mol. Mass.:58956.47
Organism:Homo sapiens (Human)
Description:Q92851
Residue:521
BDBM50426564
NameBDBM50426564
Synonyms:CHEMBL2323966
TypeSmall organic molecule
Emp. Form.C24H33ClN4O7S
Mol. Mass.557.059
SMILESCC(C)(C)[C@@H](NC(=O)c1ccc(N)c(Cl)c1)C(=O)N1CCC[C@H]1C(=O)N[C@@H](CC(O)=O)\C=C\S(C)(=O)=O