Reaction Details
TargetCaspase-5
LigandBDBM50426565
Substrate/Competitorn/a
Meas. Tech.ChEMBL_938630 (CHEMBL2327250)
IC50 750±n/a nM
Citation Rosse, G Irreversible inhibitors of cysteine proteases. ACS Med Chem Lett4:163-4 (2013) 
 
Caspase-5
Name:Caspase-5
Type:Enzyme
Mol. Mass.:49760.80
Organism:Homo sapiens (Human)
Description:P51878
Residue:434
BDBM50426565
NameBDBM50426565
Synonyms:CHEMBL2324340
TypeSmall organic molecule
Emp. Form.C36H46N6O10S
Mol. Mass.754.85
SMILESCC[C@H](C)[C@H](NC(=O)[C@H](CCC(N)=O)NC(=O)[C@H](Cc1c[nH]c2ccccc12)NC(=O)OCc1ccccc1)C(=O)N[C@@H](CC(O)=O)C=CS(C)(=O)=O