Reaction Details
TargetCaspase-10
LigandBDBM50426563
Substrate/Competitorn/a
Meas. Tech.ChEMBL_938626 (CHEMBL2327246)
IC50 420±n/a nM
Citation Rosse, G Irreversible inhibitors of cysteine proteases. ACS Med Chem Lett4:163-4 (2013) 
 
Caspase-10
Name:Caspase-10
Type:Enzyme
Mol. Mass.:58956.47
Organism:Homo sapiens (Human)
Description:Q92851
Residue:521
BDBM50426563
NameBDBM50426563
Synonyms:CHEMBL2323967
TypeSmall organic molecule
Emp. Form.C28H38N4O11S
Mol. Mass.638.687
SMILESCC(C)(C)[C@H](NC(=O)[C@H](CC(O)=O)NC(=O)OCc1ccccc1)C(=O)N1CC[C@H]1C(=O)N[C@@H](CC(O)=O)C=CS(C)(=O)=O