Reaction Details
TargetPotassium voltage-gated channel subfamily KQT member 1
LigandBDBM50371391
Substrate/Competitorn/a
Meas. Tech.ChEMBL_938824 (CHEMBL2328093)
IC50>1000±n/a nM
Citation Bagal, SKBrown, ADCox, PJOmoto, KOwen, RMPryde, DCSidders, BSkerratt, SEStevens, EBStorer, RISwain, NA Ion channels as therapeutic targets: a drug discovery perspective. J Med Chem56:593-624 (2013) 
 
Potassium voltage-gated channel subfamily KQT member 1
Name:Potassium voltage-gated channel subfamily KQT member 1
Type:PROTEIN
Mol. Mass.:74739.00
Organism:Homo sapiens (Human)
Description:ChEMBL_1454245
Residue:676
BDBM50371391
NameBDBM50371391
Synonyms:SENICAPOC
TypeSmall organic molecule
Emp. Form.C20H15F2NO
Mol. Mass.323.336
SMILESNC(=O)C(c1ccccc1)(c1ccc(F)cc1)c1ccc(F)cc1