Reaction Details
TargetSodium channel protein type 3 subunit alpha
LigandBDBM50371391
Substrate/Competitorn/a
Meas. Tech.ChEMBL_938857 (CHEMBL2328126)
IC50>1000±n/a nM
Citation Bagal, SKBrown, ADCox, PJOmoto, KOwen, RMPryde, DCSidders, BSkerratt, SEStevens, EBStorer, RISwain, NA Ion channels as therapeutic targets: a drug discovery perspective. J Med Chem56:593-624 (2013) 
 
Sodium channel protein type 3 subunit alpha
Name:Sodium channel protein type 3 subunit alpha
Type:Protein
Mol. Mass.:226276.42
Organism:Homo sapiens (Human)
Description:Q9NY46
Residue:2000
BDBM50371391
NameBDBM50371391
Synonyms:SENICAPOC
TypeSmall organic molecule
Emp. Form.C20H15F2NO
Mol. Mass.323.336
SMILESNC(=O)C(c1ccccc1)(c1ccc(F)cc1)c1ccc(F)cc1