Reaction Details
TargetInward rectifier potassium channel 4
LigandBDBM50426568
Substrate/Competitorn/a
Meas. Tech.ChEMBL_938655 (CHEMBL2327427)
IC50 24000±n/a nM
Citation Bagal, SKBrown, ADCox, PJOmoto, KOwen, RMPryde, DCSidders, BSkerratt, SEStevens, EBStorer, RISwain, NA Ion channels as therapeutic targets: a drug discovery perspective. J Med Chem56:593-624 (2013) 
 
Inward rectifier potassium channel 4
Name:Inward rectifier potassium channel 4
Type:PROTEIN
Mol. Mass.:49496.50
Organism:Homo sapiens (Human)
Description:ChEMBL_1515519
Residue:445
BDBM50426568
NameBDBM50426568
Synonyms:CHEMBL2324345
TypeSmall organic molecule
Emp. Form.C21H26N4O2
Mol. Mass.366.4567
SMILESOC(CN1CCOCC1)Cn1c2ccccc2n(Cc2ccccc2)c1=N