Reaction Details
TargetGamma-aminobutyric acid receptor subunit alpha-5
LigandBDBM50179998
Substrate/Competitorn/a
Meas. Tech.ChEMBL_938810 (CHEMBL2327954)
Ki 2.3±n/a nM
Citation Bagal, SKBrown, ADCox, PJOmoto, KOwen, RMPryde, DCSidders, BSkerratt, SEStevens, EBStorer, RISwain, NA Ion channels as therapeutic targets: a drug discovery perspective. J Med Chem56:593-624 (2013) 
 
Gamma-aminobutyric acid receptor subunit alpha-5
Name:Gamma-aminobutyric acid receptor subunit alpha-5
Type:Enzyme
Mol. Mass.:52160.59
Organism:Homo sapiens (Human)
Description:P31644
Residue:462
BDBM50179998
NameBDBM50179998
Synonyms:7-tert-butyl-3-(2,5-difluorophenyl)-6-((2-methyl-2H-1,2,4-triazol-3-yl)methoxy)-[1,2,4]triazolo[4,3-b]pyridazine | CHEMBL373250
TypeSmall organic molecule
Emp. Form.C19H19F2N7O
Mol. Mass.399.3973
SMILESCn1ncnc1COc1nn2c(nnc2cc1C(C)(C)C)-c1cc(F)ccc1F