Reaction Details
TargetTransient receptor potential cation channel subfamily V member 4
LigandBDBM50426575
Substrate/Competitorn/a
Meas. Tech.ChEMBL_938820 (CHEMBL2328089)
IC50 2300±n/a nM
Citation Bagal, SKBrown, ADCox, PJOmoto, KOwen, RMPryde, DCSidders, BSkerratt, SEStevens, EBStorer, RISwain, NA Ion channels as therapeutic targets: a drug discovery perspective. J Med Chem56:593-624 (2013) 
 
Transient receptor potential cation channel subfamily V member 4
Name:Transient receptor potential cation channel subfamily V member 4
Type:Enzyme
Mol. Mass.:98290.10
Organism:Homo sapiens (Human)
Description:Q9HBA0
Residue:871
BDBM50426575
NameBDBM50426575
Synonyms:CHEMBL2324347
TypeSmall organic molecule
Emp. Form.C14H22Cl2N2O2S
Mol. Mass.353.308
SMILESCC(C)NCCN(C(C)C)S(=O)(=O)c1ccc(Cl)cc1Cl