Reaction Details
TargetPotassium voltage-gated channel subfamily C member 1
LigandBDBM30130
Substrate/Competitorn/a
Meas. Tech.ChEMBL_938832 (CHEMBL2328101)
IC50 13100±n/a nM
Citation Bagal, SKBrown, ADCox, PJOmoto, KOwen, RMPryde, DCSidders, BSkerratt, SEStevens, EBStorer, RISwain, NA Ion channels as therapeutic targets: a drug discovery perspective. J Med Chem56:593-624 (2013) 
 
Potassium voltage-gated channel subfamily C member 1
Name:Potassium voltage-gated channel subfamily C member 1
Type:PROTEIN
Mol. Mass.:65852.49
Organism:Rattus norvegicus
Description:ChEMBL_938832
Residue:585
BDBM30130
NameBDBM30130
Synonyms:CHEMBL1201082 Fluoxetin Prozac cid_62857
TypeSmall organic molecule
Emp. Form.C17H18F3NO
Mol. Mass.309.3261
SMILESCNCCC(Oc1ccc(cc1)C(F)(F)F)c1ccccc1