Reaction Details
TargetSodium channel protein type 3 subunit alpha
LigandBDBM50300204
Substrate/Competitorn/a
Meas. Tech.ChEMBL_938849 (CHEMBL2328118)
IC50 415±n/a nM
Citation Bagal, SKBrown, ADCox, PJOmoto, KOwen, RMPryde, DCSidders, BSkerratt, SEStevens, EBStorer, RISwain, NA Ion channels as therapeutic targets: a drug discovery perspective. J Med Chem56:593-624 (2013) 
 
Sodium channel protein type 3 subunit alpha
Name:Sodium channel protein type 3 subunit alpha
Type:PROTEIN
Mol. Mass.:221371.72
Organism:Rattus norvegicus
Description:ChEMBL_1516894
Residue:1951
BDBM50300204
NameBDBM50300204
Synonyms:(2R)-2-acetylamino-N-benzyl-3-methoxypropanamide (R)-2-acetamido-N-benzyl-3-methoxypropanamide (R)-N-benzyl 2-acetamido-3-methoxypropionamide, Erlosamide | LACOSAMIDE
TypeSmall organic molecule
Emp. Form.C13H18N2O3
Mol. Mass.250.2936
SMILESCOC[C@@H](NC(C)=O)C(=O)NCc1ccccc1