Reaction Details
Target17-beta-hydroxysteroid dehydrogenase type 2
LigandBDBM50358118
Substrate/Competitorn/a
Meas. Tech.ChEMBL_938948 (CHEMBL2328437)
IC50 61±n/a nM
Citation Marchais-Oberwinkler, SXu, KWetzel, MPerspicace, ENegri, MMeyer, AOdermatt, AMöller, GAdamski, JHartmann, RW Structural optimization of 2,5-thiophene amides as highly potent and selective 17ß-hydroxysteroid dehydrogenase type 2 inhibitors for the treatment of osteoporosis. J Med Chem56:167-81 (2013) 
 
17-beta-hydroxysteroid dehydrogenase type 2
Name:17-beta-hydroxysteroid dehydrogenase type 2
Type:Oxidoreductase; single-pass type II membrane protein
Mol. Mass.:42795.29
Organism:Homo sapiens (Human)
Description:Enzyme was partially purified from human placenta.
Residue:387
BDBM50358118
NameBDBM50358118
Synonyms:CHEMBL1915964
TypeSmall organic molecule
Emp. Form.C20H18FNO3S
Mol. Mass.371.425
SMILESCOc1cccc(-c2ccc(s2)C(=O)N(C)Cc2cccc(O)c2)c1F