Reaction Details
TargetFatty-acid amide hydrolase 1 [30-579]
LigandBDBM50244993
Substrate/Competitorn/a
Meas. Tech.ChEMBL_939361 (CHEMBL2327496)
IC50 3.8±n/a nM
Citation Kono, MMatsumoto, TKawamura, TNishimura, AKiyota, YOki, HMiyazaki, JIgaki, SBehnke, CAShimojo, MKori, M Synthesis, SAR study, and biological evaluation of a series of piperazine ureas as fatty acid amide hydrolase (FAAH) inhibitors. Bioorg Med Chem21:28-41 (2012) 
 
Fatty-acid amide hydrolase 1 [30-579]
Name:Fatty-acid amide hydrolase 1 [30-579]
Type:Single-pass membrane protein; homodimer
Mol. Mass.:60474.00
Organism:Rattus norvegicus (rat)
Description:P97612 (aa 30-579)
Residue:550
BDBM50244993
NameBDBM50244993
Synonyms:4-(3-phenyl-1,2,4-thiadiazol-5-yl)-N-(pyridin-3-yl)piperazine-1-carboxamide | CHEMBL513553
TypeSmall organic molecule
Emp. Form.C18H18N6OS
Mol. Mass.366.44
SMILESO=C(Nc1cccnc1)N1CCN(CC1)c1nc(ns1)-c1ccccc1