Reaction Details
TargetFatty-acid amide hydrolase 1
LigandBDBM50426650
Substrate/Competitorn/a
Meas. Tech.ChEMBL_939360 (CHEMBL2327495)
IC50 0.860000±n/a nM
Citation Kono, MMatsumoto, TKawamura, TNishimura, AKiyota, YOki, HMiyazaki, JIgaki, SBehnke, CAShimojo, MKori, M Synthesis, SAR study, and biological evaluation of a series of piperazine ureas as fatty acid amide hydrolase (FAAH) inhibitors. Bioorg Med Chem21:28-41 (2012) 
 
Fatty-acid amide hydrolase 1
Name:Fatty-acid amide hydrolase 1
Type:Protein
Mol. Mass.:63071.19
Organism:Homo sapiens (Human)
Description:O00519
Residue:579
BDBM50426650
NameBDBM50426650
Synonyms:CHEMBL2326177
TypeSmall organic molecule
Emp. Form.C19H20FN5O2S
Mol. Mass.401.458
SMILESCc1onc(NC(=O)N2CCN(CC2)c2nc(cs2)-c2ccc(F)cc2)c1C