Reaction Details
TargetFatty-acid amide hydrolase 1
LigandBDBM50426683
Substrate/Competitorn/a
Meas. Tech.ChEMBL_939828 (CHEMBL2329421)
Ki 26±n/a nM
Citation Butini, SGemma, SBrindisi, MMaramai, SMinetti, PCelona, DNapolitano, RBorsini, FCabri, WFezza, FMerlini, LDallavalle, SCampiani, GMaccarrone, M Identification of a novel arylpiperazine scaffold for fatty acid amide hydrolase inhibition with improved drug disposition properties. Bioorg Med Chem Lett23:492-5 (2012) 
 
Fatty-acid amide hydrolase 1
Name:Fatty-acid amide hydrolase 1
Type:Protein
Mol. Mass.:63071.19
Organism:Homo sapiens (Human)
Description:O00519
Residue:579
BDBM50426683
NameBDBM50426683
Synonyms:CHEMBL2326500
TypeSmall organic molecule
Emp. Form.C23H31N3O2
Mol. Mass.381.5111
SMILESO=C(NCCCCCCc1ccccc1)Oc1cccc(c1)N1CCNCC1